{"text_format":"3","workbook":"xlsx","n_sheets":3,"sheets":["Sheet1","RTBA","AC"],"not_rendered":{"images":1,"defined_names":8,"comments":1},"read":"whole","date_system":"1900"}

{"sheet":"Sheet1","index":0,"n_rows":112,"n_cols":11,"rows_kept":112,"merged":[[0,0,0,10],[1,0,1,10],[2,0,2,10],[3,0,3,10],[6,1,6,10],[7,1,7,10],[8,0,8,10],[9,0,9,10],[10,0,10,10],[11,0,11,10],[12,0,12,1],[12,2,12,3],[12,5,12,6],[12,7,12,8],[12,9,12,10],[13,0,13,1],[13,2,13,6],[13,9,13,10],[14,0,14,3],[14,4,14,6],[15,0,15,3],[15,4,15,6],[16,0,16,10],[17,0,17,10],[18,1,18,10],[19,1,19,10],[20,1,20,10],[21,1,21,10],[22,1,22,10],[23,1,23,10],[24,1,24,10],[25,1,25,10],[26,1,26,10],[27,0,27,10],[28,0,28,10],[29,1,29,10],[30,1,30,10],[31,1,31,3],[31,4,31,10],[32,0,32,3],[32,4,32,10],[33,0,33,10],[34,8,34,10],[48,8,49,8],[48,9,49,9],[48,10,49,10],[63,8,64,8],[63,9,64,9],[63,10,64,10],[73,1,73,10],[74,4,74,6],[75,1,75,10],[76,1,76,10],[77,1,77,10],[80,0,80,10],[82,1,82,3],[82,7,82,9],[83,1,83,4],[83,7,83,10],[84,1,84,3],[84,7,84,9],[86,1,86,3],[86,7,86,9],[87,1,87,4],[87,7,87,10],[88,1,88,3],[88,7,88,9],[91,1,91,3],[91,7,91,9],[92,1,92,4],[92,7,92,10],[93,1,93,4],[93,7,93,10],[95,6,95,7],[97,2,97,10],[98,0,98,10],[99,0,99,10],[100,1,100,3],[100,7,100,9],[101,1,101,5],[101,7,101,10],[105,0,105,10],[106,0,106,2],[111,0,111,10]]}
["Major Categorical Funds"]
["Justification of Expenditure for Budget/Expense Transfer"]
["and SPSA Modification"]
["2017-18"]
[]
["Complete this form for the following change in categorical expenditures allocated in the 2017-18 SPSA:"]
[null,"BUDGET transfer within a categorical resource."]
[null,"EXPENSE transfer between and/or into categorical resources.  Budget Transaction Detail Report or Actuals Query  is required highlighting items to transfer."]
[]
["A copy of the SSC meeting minutes showing budget discussion item must be attached."]
["(Minutes must include resource, account, and amounts for both “from” and “to” and the description of the resulting benefit to students)."]
[]
["School Name:",null,{"$f":"VLOOKUP(J13,RTBA!B:C,2,FALSE)","v":"Elementary/Interim"},null,"Date:      ",null,null,"Location Number:",null,"0001"]
["Analyst:",null,{"$f":"VLOOKUP(J13,RTBA!B:I,8,FALSE)","v":""},{"$nulls":4},"Resource Teacher:",null,{"$f":"VLOOKUP(J13,RTBA!B:E,4,FALSE)","v":""}]
["Proposed Funding Resource:"]
["PAR Number (If Required): "]
["Description of Proposed Expenditure:  All expenditures should be listed individually"]
["Expenditure and Benefit to Students and/or Parent Involvement:  How is the money specifically being spent on students?  How will this affect student achievement?  Please explain your rationale for compliance for the use of categorical funds."]
["Example","4301 - Supplemental instructional supplies such as chartpaper, notebooks, and classroom leveled books to enhance ELA classroom instruction."]
["A."]
["B."]
["C."]
["D."]
["E."]
["F."]
["G."]
["H."]
["* Please list amount funded for each item on the following budget page."]
["Reason for Transfer:"]
[null,"Increase to an activity previously identified in SPSA:  "]
[null,"Transfer of expenditures due to clerical error:  "]
[null,"Other (Please specify):  "]
["Required SPSA Modification:"]
["Data used to Justify Expenditure:"]
[null,"CAASP",null,"CELDT",null,"Other (Please Specify) "]
[null,"DRA2",null,"Benchmarks"]
[]
[]
["FROM:","Dept.","Resource","Budget Ref","Account","Program","Class","Fund","Extended","Amount","Description"]
["Example","0001","30100","00",5735,1000,"1110","01000","0000",{"v":2500,"d":"$2,500.00"},{"$f":"IFERROR(VLOOKUP(E40,AC!B:C,2,FALSE),\"\")","v":"Interprogram Svcs/Field Trip"}]
["A.",{"$f":"IF($J13>0,$J13,\"\")","v":"0001"},"     ","00",null,null,"     ","01000","0000","$     ",{"$f":"IFERROR(VLOOKUP(E41,AC!B:C,2,FALSE),\"\")","v":0}]
["B.",{"$f":"IF($J13>0,$J13,\"\")","v":"0001"},"     ","00","     ","     ","     ","01000","0000","$     ",{"$f":"IFERROR(VLOOKUP(E42,AC!B:C,2,FALSE),\"\")","v":""}]
["C.",{"$f":"IF($J13>0,$J13,\"\")","v":"0001"},"     ","00",null,"     ","     ","01000","0000","$     ",{"$f":"IFERROR(VLOOKUP(E43,AC!B:C,2,FALSE),\"\")","v":0}]
["D.",{"$f":"IF($J13>0,$J13,\"\")","v":"0001"},"     ","00","     ","     ","     ","01000","0000","$     ",{"$f":"IFERROR(VLOOKUP(E44,AC!B:C,2,FALSE),\"\")","v":""}]
["E.",{"$f":"IF($J13>0,$J13,\"\")","v":"0001"},"     ","00","     ","     ","     ","01000","0000","$     ",{"$f":"IFERROR(VLOOKUP(E45,AC!B:C,2,FALSE),\"\")","v":""}]
["F.",{"$f":"IF($J13>0,$J13,\"\")","v":"0001"},"     ","00","     ","     ","     ","01000","0000","$     ",{"$f":"IFERROR(VLOOKUP(E46,AC!B:C,2,FALSE),\"\")","v":""}]
["G.",{"$f":"IF($J13>0,$J13,\"\")","v":"0001"},"     ","00","     ","     ","     ","01000","0000","$     ",{"$f":"IFERROR(VLOOKUP(E47,AC!B:C,2,FALSE),\"\")","v":""}]
["H.",{"$f":"IF($J13>0,$J13,\"\")","v":"0001"},"     ","00","     ","     ","     ","01000","0000","$     ",{"$f":"IFERROR(VLOOKUP(E48,AC!B:C,2,FALSE),\"\")","v":""}]
[{"$nulls":8},"Total",{"$f":"SUM(J41:J48)","v":0}]
[]
[]
[]
[]
["TO:","Dept.","Resource","Budget Ref","Account","Program","Class","Fund","Extended","Amount","Description"]
["Example","0001","30100","00",4301,1000,"1110","01000","0000",{"v":2500,"d":"$2,500.00"},{"$f":"IFERROR(VLOOKUP(E55,AC!B:C,2,FALSE),\"\")","v":"Supplies"}]
["A.",{"$f":"IF($J13>0,$J13,\"\")","v":"0001"},"     ","00","     ","     ","     ","01000","0000","$     ",{"$f":"IFERROR(VLOOKUP(E56,AC!B:C,2,FALSE),\"\")","v":""}]
["B.",{"$f":"IF($J13>0,$J13,\"\")","v":"0001"},"     ","00","     ","     ","     ","01000","0000","$     ",{"$f":"IFERROR(VLOOKUP(E57,AC!B:C,2,FALSE),\"\")","v":""}]
["C.",{"$f":"IF($J13>0,$J13,\"\")","v":"0001"},"     ","00","     ","     ","     ","01000","0000","$     ",{"$f":"IFERROR(VLOOKUP(E58,AC!B:C,2,FALSE),\"\")","v":""}]
["D.",{"$f":"IF($J13>0,$J13,\"\")","v":"0001"},"     ","00","     ","     ","     ","01000","0000","$     ",{"$f":"IFERROR(VLOOKUP(E59,AC!B:C,2,FALSE),\"\")","v":""}]
["E.",{"$f":"IF($J13>0,$J13,\"\")","v":"0001"},"     ","00","     ","     ","     ","01000","0000","$     ",{"$f":"IFERROR(VLOOKUP(E60,AC!B:C,2,FALSE),\"\")","v":""}]
["F.",{"$f":"IF($J13>0,$J13,\"\")","v":"0001"},"     ","00","     ","     ","     ","01000","0000","$     ",{"$f":"IFERROR(VLOOKUP(E61,AC!B:C,2,FALSE),\"\")","v":""}]
["G.",{"$f":"IF($J13>0,$J13,\"\")","v":"0001"},"     ","00","     ","     ","     ","01000","0000","$     ",{"$f":"IFERROR(VLOOKUP(E62,AC!B:C,2,FALSE),\"\")","v":""}]
["H.",{"$f":"IF($J13>0,$J13,\"\")","v":"0001"},"     ","00","     ","     ","     ","01000","0000","$     ",{"$f":"IFERROR(VLOOKUP(E63,AC!B:C,2,FALSE),\"\")","v":""}]
[{"$nulls":8},"Total",{"$f":"SUM(J56:J63)","v":0}]
{"$rows_empty":8}
["Site Assurances:"]
[null,"Student achievement data and site plan strategies were reviewed and analyzed.  Based on our findings, the SSC has approved modifying our Single Plan for Student Achievement (SPSA) and categorical budget."]
[null,"List date(s) of SSC meeting(s):"]
[null,"A copy of the SSC meeting minutes showing plan and budget discussion item is attached, and discussion/approval item is highlighted (Includes resource, account, and amounts)."]
[null,"A copy of the Detailed Transaction Report is attached and highlighted (expenses only)."]
[null,"The expense is supplemental to district-provided services."]
[]
["Required Signatures:"]
["The undersigned declare under penalty of perjury that the foregoing is true and correct and that these assurances were signed in San Diego, California, on the date(s) indicated."]
[]
[]
[null,"_____________________________________",{"$nulls":5},"_______________________________________________"]
[null,"Principal (Print Name)",null,null,"Date",null,null,"SSC Chairperson (Print Name)",null,null,"Date"]
[]
[]
{"$rows_left_out":26}
{"sheet":"RTBA","index":1,"n_rows":1342,"n_cols":11,"rows_kept":1342,"hidden":true}
["DeptID",null,"Long Description","RT","RT1","RT3","RT4","BA","BA 2","BA3","BA4"]
[0,{"$f":"TEXT(A2,\"0000\")","v":"0000"},"All Cost Centers Combined",null,{"$f":"IFERROR(VLOOKUP(D2,F:G,2,FALSE),\"\")","v":""},"MJ","Mary Johnson: 619-725-5611",null,{"$f":"IFERROR(VLOOKUP(H2,J:K,2,FALSE),\"\")","v":""},"BG","Bich Ha Groll: 619-725-7788"]
[1,{"$f":"TEXT(A3,\"0000\")","v":"0001"},"Elementary/Interim",null,{"$f":"IFERROR(VLOOKUP(D3,F:G,2,FALSE),\"\")","v":""},"DG","Dario Gutierrez: 619-725-7785","BT1",{"$f":"IFERROR(VLOOKUP(H3,J:K,2,FALSE),\"\")","v":""},"TJ","Tammy Jackson: 619-725-7640"]
[2,"0002","Elementary/Personnel",null,"","SJKW","Susan Weinshanker: 619-725-5614","BT1","","RC","Rita Clegg: 619-725-7644"]
[3,"0003","Adams Elementary","MJ","Mary Johnson: 619-725-5611",null,null,"BG","Bich Ha Groll: 619-725-7788","TR","Tenya Rushing: 619-725-7637"]
[4,"0004","Alcott Elementary","MJ","Mary Johnson: 619-725-5611",null,null,"TJ","Tammy Jackson: 619-725-7640","DG","Debbie Glanz: 619-725-7619"]
[5,"0005","Andersen Elementary",null,"",{"$nulls":3},"","BH","Bill Hallaran: 619-725-7631"]
[6,"0006","Adams Annex",null,"",null,null,"inactive","","SDS","Sally Dexter-Smith: 619-725-7627"]
[7,"0007","Angier Elementary","DG","Dario Gutierrez: 619-725-7785",null,null,"RC","Rita Clegg: 619-725-7644","MH","Maurice Hernandez: 619-725-7647"]
[8,"0008","Audeo",null,"",null,null,"AD","","MS","Michelle Speegle: 619-725-7634"]
[9,"0009","Audubon K-8","DG","Dario Gutierrez: 619-725-7785",null,null,"TR","Tenya Rushing: 619-725-7637","DA","Dawn Ahlers: 619-725-7621"]
[10,"0010","e3 Civic High",null,"",null,null,"AD","","PH","Paula Hall: 619-725-7639"]
[11,"0011","Baker Elementary","DG","Dario Gutierrez: 619-725-7785",null,null,"DG","Debbie Glanz: 619-725-7619","TV","Tania Valero: 619-725-7638"]
[12,"0012","Balboa Park Program",null,"",null,null,"ML","Margaret Latham: 619-725-7472","JM3","Joy Milus: 619-725-7787"]
[13,"0013","Balboa Elementary","DG","Dario Gutierrez: 619-725-7785",null,null,"DG","Debbie Glanz: 619-725-7619","JC","Jeff Clemons: 619-725-7783"]
[14,"0014","Old Town Academy K-8 Charter",null,"",null,null,"AD","","GS","Gustav Swanson: 619-725-7616"]
[15,"0015","Bandini Elementary",null,"",null,null,"inactive","","ML","Margaret Latham: 619-725-7472"]
[16,"0016","Elevate Elementary CS",null,"",null,null,"AD",""]
[17,"0017","Barnard Elementary","DG","Dario Gutierrez: 619-725-7785",null,null,"JM3","Joy Milus: 619-725-7787"]
[18,"0018","Learning Choice Academy",null,"",null,null,"AD",""]
[19,"0019","Linda Vista Annex",null,"",null,null,"inactive",""]
[21,"0021","Bay Park Elementary","MJ","Mary Johnson: 619-725-5611",null,null,"TJ","Tammy Jackson: 619-725-7640"]
[22,"0022","High Tech Elementary",null,"",null,null,"AD",""]
[23,"0023","Bayview Terrace Elementary",null,"",null,null,"inactive",""]
[24,"0024","Ingenuity Charter School",null,"",null,null,"AD",""]
[25,"0025","Beale Elementary",null,"",{"$nulls":3},""]
[26,"0026","King-Chavez Arts Academy",null,"",null,null,"AD",""]
[27,"0027","Benchley",null,"",null,null,"inactive",""]
[28,"0028","Thrive Public School",null,"",null,null,"AD",""]
[29,"0029","Bird Rock Elementary","MJ","Mary Johnson: 619-725-5611",null,null,"RC","Rita Clegg: 619-725-7644"]
[31,"0031","Birney Elementary","MJ","Mary Johnson: 619-725-5611",null,null,"TR","Tenya Rushing: 619-725-7637"]
[33,"0033","Boone Elementary","DG","Dario Gutierrez: 619-725-7785",null,null,"TR","Tenya Rushing: 619-725-7637"]
[35,"0035","Breen",null,"",{"$nulls":3},""]
[37,"0037","Brooklyn Elementary",null,"",null,null,"inactive",""]
[39,"0039","Burbank Elementary","MJ","Mary Johnson: 619-725-5611",null,null,"BG","Bich Ha Groll: 619-725-7788"]
[41,"0041","Cabrillo Elementary","DG","Dario Gutierrez: 619-725-7785",null,null,"JM3","Joy Milus: 619-725-7787"]
[43,"0043","Cadman Elementary","MJ","Mary Johnson: 619-725-5611",null,null,"TJ","Tammy Jackson: 619-725-7640"]
[44,"0044","King-Chavez Primary Academy",null,"",null,null,"AD",""]
[45,"0045","Camp Cuyamaca",null,"",{"$nulls":3},""]
[47,"0047","Camp Denver C. Fox",null,"",{"$nulls":3},""]
[49,"0049","Camp Maston",null,"",{"$nulls":3},""]
[51,"0051","Camp Palomar",null,"",{"$nulls":3},""]
[52,"0052","Jola Community Charter",null,"",null,null,"AD",""]
[55,"0055","Carson Elementary","DG","Dario Gutierrez: 619-725-7785",null,null,"RC","Rita Clegg: 619-725-7644"]
[56,"0056","Childrens Conservation Academy",null,"",null,null,"inactive",""]
[57,"0057","Carver Elementary","MJ","Mary Johnson: 619-725-5611",null,null,"MH","Maurice Hernandez: 619-725-7647"]
[58,"0058","Central/Cal-Trans Project",null,"",{"$nulls":3},""]
[59,"0059","Central Elementary","MJ","Mary Johnson: 619-725-5611",null,null,"BG","Bich Ha Groll: 619-725-7788"]
[60,"0060","Chavez Elementary","DG","Dario Gutierrez: 619-725-7785",null,null,"DG","Debbie Glanz: 619-725-7619"]
[61,"0061","Chesterton Elementary","DG","Dario Gutierrez: 619-725-7785",null,null,"RC","Rita Clegg: 619-725-7644"]
[62,"0062","Cherokee Point Elementary","MJ","Mary Johnson: 619-725-5611",null,null,"BG","Bich Ha Groll: 619-725-7788"]
[63,"0063","Chollas/Mead Elementary","DG","Dario Gutierrez: 619-725-7785",null,null,"DG","Debbie Glanz: 619-725-7619"]
[65,"0065","Clay Elementary","MJ","Mary Johnson: 619-725-5611",null,null,"MH","Maurice Hernandez: 619-725-7647"]
[66,"0066","Civita Property",null,"",null,null,"GS","Gustav Swanson: 619-725-7616"]
[67,"0067","Cleveland Elementary",null,"",{"$nulls":3},""]
[68,"0068","King-Chavez Athletics Academy",null,"",null,null,"AD",""]
[71,"0071","Crocket Site",null,"",{"$nulls":3},""]
[73,"0073","Crown Point Elementary","DG","Dario Gutierrez: 619-725-7785",null,null,"JM3","Joy Milus: 619-725-7787"]
[74,"0074","Iftin Charter",null,"",null,null,"AD",""]
[75,"0075","Cubberley Elementary","DG","Dario Gutierrez: 619-725-7785",null,null,"RC","Rita Clegg: 619-725-7644"]
[76,"0076","Magnolia Science Academy",null,"",null,null,"AD",""]
[77,"0077","Curie Elementary","DG","Dario Gutierrez: 619-725-7785",null,null,"BG","Bich Ha Groll: 619-725-7788"]
[78,"0078","Dailard Elementary","MJ","Mary Johnson: 619-725-5611",null,null,"TJ","Tammy Jackson: 619-725-7640"]
[79,"0079","Darnall E-Charter",null,"",null,null,"AD",""]
[80,"0080","Dana","DG","Dario Gutierrez: 619-725-7785",null,null,"JM3","Joy Milus: 619-725-7787"]
[82,"0082","King-Chavez Preparatory",null,"",null,null,"AD",""]
[83,{"$f":"TEXT(A67,\"0000\")","v":"0083"},"Decatur Elementary",null,{"$f":"IFERROR(VLOOKUP(D67,F:G,2,FALSE),\"\")","v":""},{"$nulls":3},{"$f":"IFERROR(VLOOKUP(H67,J:K,2,FALSE),\"\")","v":""}]
[85,"0085","Dewey Elementary","DG","Dario Gutierrez: 619-725-7785",null,null,"JM3","Joy Milus: 619-725-7787"]
[86,"0086","Dingeman Elementary","MJ","Mary Johnson: 619-725-5611",null,null,"MH","Maurice Hernandez: 619-725-7647"]
[87,"0087","Doyle Elementary","DG","Dario Gutierrez: 619-725-7785",null,null,"BG","Bich Ha Groll: 619-725-7788"]
[89,"0089","Edison Elementary","MJ","Mary Johnson: 619-725-5611",null,null,"BG","Bich Ha Groll: 619-725-7788"]
[90,"0090","Scripps Elementary","MJ","Mary Johnson: 619-725-5611",null,null,"MH","Maurice Hernandez: 619-725-7647"]
[91,"0091","Emerson/Bandini Elementary","MJ","Mary Johnson: 619-725-5611",null,null,"BG","Bich Ha Groll: 619-725-7788"]
[92,"0092","Einstein Academy",null,"",null,null,"AD",""]
[93,"0093","Encanto Elementary","DG","Dario Gutierrez: 619-725-7785",null,null,"DG","Debbie Glanz: 619-725-7619"]
[95,"0095","Euclid Elementary","MJ","Mary Johnson: 619-725-5611",null,null,"MH","Maurice Hernandez: 619-725-7647"]
[99,"0099","Farnum Center-Site Demolished",null,"",{"$nulls":3},""]
[103,"0103","Field Elementary","MJ","Mary Johnson: 619-725-5611",null,null,"MS","Michelle Speegle: 619-725-7634"]
[105,"0105","Fletcher Elementary","DG","Dario Gutierrez: 619-725-7785",null,null,"RC","Rita Clegg: 619-725-7644"]
[107,"0107","Florence Elementary","MJ","Mary Johnson: 619-725-5611",null,null,"MH","Maurice Hernandez: 619-725-7647"]
{"$rows_left_out":1263}
{"sheet":"AC","index":2,"n_rows":2335,"n_cols":4,"rows_kept":2335,"hidden":true}
["Account","Account","Long Descr"]
["0000",{"$f":"VALUE(A2)","v":0}]
["0341",341,"SD Millennial Tech Magnet"]
["1000",1000,"Certificated Salaries"]
["1100",1100,"Teachers'  Salaries"]
["1101",1101,"Teacher/Childrens Center","Spsa"]
["1103",1103,"Teacher/Clsrm/Preschool","1.  Strategies to meet ELA/Math/ELD goals (Maximizing Instructional Time)"]
["1107",1107,"Classroom Teacher","1.  Strategies to meet ELA/Math/ELD goals (Maximizing Instructional Time)"]
["1109",1109,"Pull/Out Push In","2.  Strategies to meet ELA/Math/ELD goals (Closing the Gap)"]
["1113",1113,"Teacher/Clsrm/GATE","3.  Strategies to meet ELA/Math/ELD goals (Professional Development)"]
["1114",1114,"Enrollment Reserve","4.  Strategies to meet graduation/promotion rates (Social/Emotional Supports)"]
["1118",1118,"Prep Time Teacher Allocation","5.  Strategies to meet parent engagement goals"]
["1128",1128,"Resource Specialist","5.  Strategies to meet parent engagement goals"]
["1132",1132,"Master/Lead Teacher","5.  Strategies to meet parent engagement goals"]
["1136",1136,"Lv of Absence NonPay Status","5.  Strategies to meet parent engagement goals"]
["1147",1147,"Clsrm Cert Salry Undist Contra","5.  Strategies to meet parent engagement goals"]
["1150",1150,"Teacher Asst/Clsrm/Hrly","LCFF Intervention Supports"]
["1151",1151,"Teacher/Childrens Ctr/Hrly","LCFF Intervention Supports"]
["1152",1152,"Extended Day Pay Per Unit","LCFF Intervention Supports"]
["1153",1153,"Tchr/Clsrm/Preschool/Hrly","LCFF Intervention Supports"]
["1154",1154,"Enrollment Reserve","LCFF Intervention Supports"]
["1157",1157,"Classroom Teacher Hrly","LCFF Intervention Supports"]
["1158",1158,"Techer/Clsrm/Ext Day/ROTC","LCFF Intervention Supports"]
["1159",1159,"PullOut/Push in Hrly","1.  Strategies to meet ELA/Math/ELD goals (Maximizing Instructional Time)"]
["1160",1160,"Student Teacher Supv","1.  Strategies to meet ELA/Math/ELD goals (Maximizing Instructional Time)"]
["1161",1161,"Sub In Lieu of Overformula","1.  Strategies to meet ELA/Math/ELD goals (Maximizing Instructional Time)"]
["1162",1162,"Short Term Leave Visiting Tchr","2.  Strategies to meet ELA/Math/ELD goals (Closing the Gap)"]
["1163",1163,"Long Term Leave Visiting Tchr","2.  Strategies to meet ELA/Math/ELD goals (Closing the Gap)"]
["1164",1164,"Teacher/ClsrmSuper/Hrly","2.  Strategies to meet ELA/Math/ELD goals (Closing the Gap)"]
["1165",1165,"Jury & Berevmnt Visiting Tchr","5.  Strategies to meet parent engagement goals"]
["1168",1168,"Tchr/Elem/PrepTime/Hrly","5.  Strategies to meet parent engagement goals"]
["1170",1170,"Prof&Curriclm DevHrlyClsrmTchr","5.  Strategies to meet parent engagement goals"]
["1171",1171,"Hourly Tutorial Assignment","LCFF Intervention Supports"]
["1178",1178,"Resource Specialist Hrly","LCFF Intervention Supports"]
["1182",1182,"Master Lead Tchr/Hrly","LCFF Intervention Supports"]
["1186",1186,"Other Cert/Ret/Consultant/Cl","1.  Strategies to meet ELA/Math/ELD goals (Maximizing Instructional Time)"]
["1187",1187,"Adult Ed/Hrly","1.  Strategies to meet ELA/Math/ELD goals (Maximizing Instructional Time)"]
["1189",1189,"Retired Clsrm Teacher Hrly","2.  Strategies to meet ELA/Math/ELD goals (Closing the Gap)"]
["1192",1192,"Prof&Curriclm Dev Vist Tchr","2.  Strategies to meet ELA/Math/ELD goals (Closing the Gap)"]
["1197",1197,"Clsrm Cert Hrly Undist/Contra","3.  Strategies to meet ELA/Math/ELD goals (Professional Development)"]
["1200",1200,"Certificated Pupil Support Sal","3.  Strategies to meet ELA/Math/ELD goals (Professional Development)"]
["1201",1201,"Librarian","4.  Strategies to meet graduation/promotion rates (Social/Emotional Supports)"]
["1202",1202,"Principal/Special Assign/Cert","4.  Strategies to meet graduation/promotion rates (Social/Emotional Supports)"]
["1203",1203,"Vice-Principal/School Site","5.  Strategies to meet parent engagement goals"]
["1204",1204,"Vice Principal/Spec Assign/Cer","LCFF Intervention Supports"]
["1206",1206,"OCILE Administrator","LCFF Intervention Supports"]
["1208",1208,"Charter School Admin/Cert","LCFF Intervention Supports"]
["1210",1210,"Counselor","1.  Strategies to meet ELA/Math/ELD goals (Maximizing Instructional Time)"]
["1220",1220,"Psychologist","1.  Strategies to meet ELA/Math/ELD goals (Maximizing Instructional Time)"]
["1230",1230,"Audiologist/Audiometrist","1.  Strategies to meet ELA/Math/ELD goals (Maximizing Instructional Time)"]
["1240",1240,"Nurse","1.  Strategies to meet ELA/Math/ELD goals (Maximizing Instructional Time)"]
["1251",1251,"Librarian Hrly","1.  Strategies to meet ELA/Math/ELD goals (Maximizing Instructional Time)"]
["1253",1253,"Vice-Principal/Sch. Site/Hrly","1.  Strategies to meet ELA/Math/ELD goals (Maximizing Instructional Time)"]
["1258",1258,"Charter School/Admin/Hrly","2.  Strategies to meet ELA/Math/ELD goals (Closing the Gap)"]
["1260",1260,"Counselor Hrly","3.  Strategies to meet ELA/Math/ELD goals (Professional Development)"]
["1262",1262,"Nurse/Counslr/Psychologist Sub","3.  Strategies to meet ELA/Math/ELD goals (Professional Development)"]
["1270",1270,"Psychologist Hrly","4.  Strategies to meet graduation/promotion rates (Social/Emotional Supports)"]
["1280",1280,"Audiologist/Audiometrist Hrly","4.  Strategies to meet graduation/promotion rates (Social/Emotional Supports)"]
["1290",1290,"Nurse Hrly","5.  Strategies to meet parent engagement goals"]
["1300",1300,"Cert Super and Admin Sal","5.  Strategies to meet parent engagement goals"]
["1301",1301,"Superintendent","5.  Strategies to meet parent engagement goals"]
["1302",1302,"Chief SIO/Depty Superintdnt","LCFF Intervention Supports"]
["1303",1303,"Coordinator/Cert","LCFF Intervention Supports"]
["1305",1305,"Chief/Exec/Dir/Admin (Rep)","LCFF Intervention Supports"]
["1306",1306,"Chief/Exec/Dir/Admin(Non-Rep)","LCFF Intervention Supports"]
["1307",{"$f":"VALUE(A66)","v":1307},"Assistant Director/Cert","LCFF Intervention Supports"]
["1308",1308,"School Principal","1.  Strategies to meet ELA/Math/ELD goals (Maximizing Instructional Time)"]
["1309",1309,"Vice-Principal","2.  Strategies to meet ELA/Math/ELD goals (Closing the Gap)"]
["1311",1311,"Manager","2.  Strategies to meet ELA/Math/ELD goals (Closing the Gap)"]
["1313",1313,"Other Admin Cert","2.  Strategies to meet ELA/Math/ELD goals (Closing the Gap)"]
["1315",1315,"Admin On Special Assignment","4.  Strategies to meet graduation/promotion rates (Social/Emotional Supports)"]
["1321",1321,"Director","5.  Strategies to meet parent engagement goals"]
["1358",1358,"Principal Hrly","5.  Strategies to meet parent engagement goals"]
["1359",1359,"Vice-Principal Hrly","5.  Strategies to meet parent engagement goals"]
["1361",1361,"Manager/Admin Hrly","LCFF Intervention Supports"]
["1363",1363,"Administrator/Cert/Hrl","LCFF Intervention Supports"]
["1365",1365,"Admin/Spec Assign/Hrly","LCFF Intervention Supports"]
["1386",1386,"Retired Admin Hrly","LCFF Intervention Supports"]
["1401",1401,"Librarian/Cert","LCFF Intervention Supports"]
["1451",1451,"Librarian/Cert/Hrly","LCFF Intervention Supports"]
{"$rows_left_out":2255}